Home > Fatal Error > Fatal Error Call To Undefined Function Mosshowhead

Fatal Error Call To Undefined Function Mosshowhead

I have searched the forums here but cannot find anything that works. If I disable it -- no error. Offline georg Недавно здесь Регистрация: 19.05.2010 Сообщения: 66 Симпатии: 0 Пол: Мужской That's the file that should contain that missing function, as well as quite a few more. his comment is here

Updating status to RTBC. What is Magento? XenForo Add-ons by Brivium ™ © 2012-2016 Brivium LLC. Log in or register to post comments Comment #35 February 20, 2015 at 11:57pm Status: Reviewed & tested by the community » Needs work The last submitted patch, 31: 1699312-29-element-validation-handler-loading.patch, failed find this

Field label plurals adds some ajax to the form. Ran the patch in #31 against date 2.8 and it solved the problem. Log in or register to post comments Comment #10 pounard CreditAttribution: pounard commented May 17, 2013 at 9:45am Status: Needs work » Needs review FileSize 1699312-10-date_field_validate_fatal.patch1.17 KB FAILED: [[SimpleTest]]: [MySQL] 138 Log in or register to post comments Comment #4 August 2, 2012 at 9:34am Status: Closed (works as designed) » Needs work The last submitted patch, 1699312-element-validation-handler-loading-3.patch, failed testing.

Log in or register to post comments Comment #5 Niklas Fiekas CreditAttribution: Niklas Fiekas commented August 2, 2012 at 9:36am Status: Needs work » Needs review (Test failures look unrelated.) Log CMS > Создание сайта на CMS Joomla > Внешний вид, шаблоны, графика > Создание шаблона > Последняя версия CMS Joomla! 3.6.2 Форум Форум Быстрые ссылки Поиск сообщений Последние сообщения Расширения Расширения Join today Download & Extend Drupal Core Distributions Modules Themes DateIssues Fatal error: Call to undefined function date_field_widget_settings_form_validate() in form.inc Closed (fixed)Project:DateVersion:7.x-2.x-devComponent:Date FieldPriority:NormalCategory:Bug reportAssigned:UnassignedReporter:glowsinthedarkCreated:July 24, 2012 - 21:42Updated:May 11, 2016 - Here's a patch that would solve this by moving the validation handlers next to the form builder stubs.

If I enable it and try to edit a date field -- error. Merci d'avance Mes liens: Profil | Blog Mes articles Java : JSF 2.0 | NetBeans 6.9/OSGi Mes articles Webmarketing : Apprenez mixer, filtrer, diffrentes sources de flux (RSS,...) Vidos pour See the log in the details link for more information. Thanks all!

So I'm assuming this bug can have multiple different causes. Log in or register to post comments Comment #32 pfrenssen CreditAttribution: pfrenssen commented October 22, 2014 at 10:35am Status: Needs review » Reviewed & tested by the community For me this Log in or register to post comments Comment #34 February 20, 2015 at 11:35pm guidot queued 31: 1699312-29-element-validation-handler-loading.patch for re-testing. 0 Welcome Guest!

View 1699312-10-date_field_validate_fatal.patch1.17 KB FAILED: [[SimpleTest]]: [MySQL] 138 pass(es), 9 fail(s), and 0 exception(s). http://www.simplemachines.org/community/index.php?topic=58683.0 erreur PDF Par bjo393 dans le forum Langage Rponses: 1 Dernier message: 31/05/2013, 14h05 erreur fireboard sous joomla Par marsamandes dans le forum Autres (SMF, etc.) Rponses: 1 Dernier message: 22/06/2007, Logged http://www.technoadvice.com Gobo Sr. And, I'm happy to help.Also, you probably would have noticed for a while, but watch out for other missing file errors.

Offline georg Недавно здесь Регистрация: 19.05.2010 Сообщения: 66 Симпатии: 0 Пол: Мужской Спасибо. Подскажите как мне определить под какой движок я делаю шаблон, я еще новичек по работе с joomla. По this content Forum Actions Marquer les forums comme lus Bugs & Suggestions Rseau social Groupes Liste des utilisateurs FAQ forum Voir l'quipe du site Blogs Agenda Rgles Blogs Projets Recherche avance Index du Feel free to remove this issue or keep it around in case someone else has the same issue. Joomlaportal.de ist kein Bestandteil der OpenSourceMatters oder des Joomla!

  1. Log in or register to post comments Comment #2 KarenS CreditAttribution: KarenS commented July 29, 2012 at 12:19pm Title: Fatal Error (undefined function date_field_widget_settings_form_validate()) when saving date field edit settings »
  2. Log in or register to post comments Comment #16 mcabalaji CreditAttribution: mcabalaji commented November 22, 2013 at 7:56pm Status: Needs work » Needs review 12: 1699312-12-date_field_validate_fatal.patch queued for re-testing.
  3. DS . "rt_utils.php"); require(YOURBASEPATH .
  4. View #22 1699312-21-element-validation-handler-loading.patch7.95 KBgmclelland FAILED: [[SimpleTest]]: [MySQL] 4,286 pass(es), 980 fail(s), and 129 exception(s).
  5. When the AJAX response is generated only date.field.inc is loaded which contains the main date_field_instance_settings_form.
  6. Unfortunately, I need the plurals module; the only temporary solution seems to be to disable (deactivate) the plurals module, modify the date field, then reactivate (re-enable) the plurals module.

Auch wenns peinlich ist, sowas soll ja nicht nochmal vorkommen. ActualitsFAQ PHPCours PHPSources PHPLivres PHPScripts PHPOutils PHPSymfonyZend Framework Index du forum PHP Scripts CMS Joomla Joomla erreur mosShowHead() « Discussion prcdente | Discussion suivante » Discussions similaires Joomla! and am still getting the same error. http://indywebshop.com/fatal-error/fatal-error-call-to-undefined-function-override-function.php The page seems to refresh and nothing has changed.

Log in or register to post comments Comment #3 Niklas Fiekas CreditAttribution: Niklas Fiekas commented August 2, 2012 at 9:36am FileSize 1699312-element-validation-handler-loading-3.patch8.17 KB FAILED: [[SimpleTest]]: [MySQL] 5,214 pass(es), 4 fail(s), and View Here is a reroll of #3 Log in or register to post comments Comment #23 gmclelland CreditAttribution: gmclelland commented January 15, 2014 at 11:29pm Status: Needs work » Needs review Log in or register to post comments Comment #31 netlooker CreditAttribution: netlooker commented October 15, 2014 at 2:35pm Version: 7.x-2.6 » 7.x-2.x-dev Status: Needs work » Needs review FileSize 1699312-29-element-validation-handler-loading.patch31.69 KB

How will the joomla integrate with SMF since I have about 25 registered users.

However I have noticed that the admin password for my joomla and smf are different. Log in or register to post comments Comment #11 May 17, 2013 at 9:49am Status: Needs review » Needs work The last submitted patch, 1699312-10-date_field_validate_fatal.patch, failed testing. In jedem Fall bestehen zu bleiben hat der Link im Footer des Templates welcher zurck auf meine Seite fhrt. I'll post an issue, if needed in the Field label plurals module issuse queue as well.

Member Posts: 912 Gender: Peace Be Upon You Re: What did I do wrong here? « Reply #7 on: December 01, 2005, 11:14:55 AM » thanks and ur welcome Logged Print Joomlagott Registriert seit 08.10.2004 Ort Oestrich-Winkel Alter 41 Beitrge 10.141 Bedankte sich 53 Erhielt 1.060 Danksagungen in 938 Beitrgen Kann es sein, dass Du auf Deiner Mamboversion ein Modul oder eine Rocketeer Posts: 117 Thanks: 0 adding into the head section Posted 7 years 7 months ago By adding the Jom Comment component to any of Rocketthemes templates check over here Generated Sat, 15 Oct 2016 15:39:40 GMT by s_ac15 (squid/3.5.20)

Unable to apply patch. If they are in SMF, they will get migrated to Joomla as they log in. Log in or register to post comments Comment #27 pounard CreditAttribution: pounard commented February 12, 2014 at 10:27pm The "Field Label Plurals" module does seem to be the culprit. Forums Tutoriels Magazine FAQs Blogs Chat Newsletter tudes Emploi Club Contacts Developpez.com - PHP Forums Autre rubrique X Choisissez d'abord la catgorieensuite la rubrique : AccueilActualits IT Pro ALMCycle de vie

Dieser Link darf in keinster Weise verndert werden - wem das nicht passt, muss meine Templates ja nicht nutzen. START --> ?>       Log in or register to post comments Comment #9 September 14, 2012 at 4:13pm Status: Reviewed & tested by the community » Needs work The last submitted patch, 1699312-element-validation-handler-loading-3.patch, failed testing. Advertisement: SMF 2.0.12 | SMF © 2016, Simple Machines XHTML RSS WAP2 Page created in 0.537 seconds with 18 queries.Page served by: 10.0.100.135 (10.0.100.114) WordPress.org Search WordPress.org for: Showcase Themes

Log in or register to post comments Comment #26 Katrina B CreditAttribution: Katrina B commented February 12, 2014 at 8:43pm The "Field Label Plurals" module does seem to be the culprit. I reviewed the patch. Oder gibt es eine Mglichkeit 4.5.1 Templates auch unter 4.5 zu verwenden? 13.11.200420:04 #4 zecke23 Urgestein u. More Info: ============================= http://www.augs-burg.de */ defined( '_JEXEC' ) or die( 'Direct Access to this location is not allowed.' ); ?> "; ?>

If I redo changes and save, I get the following truncated error: Fatal error: Call to undefined function date_field_widget_settings_form_validate() in .../drupal/includes/form.inc on line 1389 I'm not sure where to start troubleshooting Member Posts: 912 Gender: Peace Be Upon You What did I do wrong here? « on: November 29, 2005, 09:58:52 PM » Ok I posted the same question at joomla but But not a strict re-roll. Not a great solution -- but one that works (for now).

und vBulletin Solutions, Inc. I've checked latest patch and I was able to apply it without problems. FAPI is executing #element_validate handlers, but since this is a new request date_admin.inc has not been included.