Home > Fatal Error > Fatal Error Asm/bitops.h

Fatal Error Asm/bitops.h

View 6 Replies View Related General :: Cmem.c:38:19: Error: Stdio.h: No Such File Or Directory Aug 10, 2010 I am trying to compile a memory map module cmem.ko from TI codec Read More NEWS   10 Nov 2015 What’s next for your wearables design? nr = 0 -> byte 0 bit 0. 161 */ 162 extern int _find_first_zero_bit_le(const void * p, unsigned size); 163 extern int _find_next_zero_bit_le(const void * p, int size, int offset); 164 But I really need help on this library issue!! http://indywebshop.com/fatal-error/fatal-error-fatal-sys-hardware.php

Advertisement Training See all LFD450 Embedded Linux Development October 24, 2016 Learn more LFS462 Linux KVM Virtualization October 24, 2016 Learn more LFD430 Developing Linux Device Drivers October 31, 2016 Learn WaRP 7 Read More NEWS   10 Nov 2015 7 playful uses for NFC in gaming Read More NEWS   6 Nov 2015 Meet an NFC innovator: Speech Code Read More NEWS   5 I am using the following command to compile the process_30sec.c file: [email protected]:~/Desktop$ gcc process_30sec.c The above mentioned program file contains a header file , that I need to use in the kernel 3.3.4-3 64 bit george_toolan13th May 2012, 09:10 AMInstall kernel-headers and kernel-devel and then try one of these: /usr/src/kernels/3.3.4-3.fc16.x86_64/arch/x86/include/asm/linkage.h /usr/src/kernels/3.3.4-3.fc16.x86_64/include/asm-generic/linkage.h /usr/src/kernels/3.3.4-3.fc16.x86_64/include/linux/linkage.h and one of these: /usr/src/kernels/3.3.4-3.fc16.x86_64/arch/x86/include/asm/bitops.h /usr/src/kernels/3.3.4-3.fc16.x86_64/include/asm-generic/bitops.h /usr/src/kernels/3.3.4-3.fc16.x86_64/include/linux/bitops.h DutchRicky16th December 2012, http://stackoverflow.com/questions/12898107/how-to-include-kernel-headers-in-a-program

The /etc/fstab file does not exist anymore and i cant rename the fstab.bak because the disk is read-only even for my root user View 1 Replies View Related General :: Can't Introduction to Linux - A Hands on Guide This guide was created as an overview of the Linux Operating System, geared toward new users as an exploration tour and getting started A maintenance shell will now be started. Zero input is undefined. 284 */ 285 static inline unsigned long __fls(unsigned long x) 286 { 287 return fls(x) - 1; 288 } 289 290 /* 291 * ffs() returns zero

I also get this error when trying to open any other home folder, like music, or pictures. Please don't fill out this field. export CROSS_COMPILE=arm-none-linux-gnueabi- 3. Re: [SD4L-user] Compiling on kernel 3.0.0.12 From: Jonathan Coles - 2011-10-22 12:16:32 Ulrich, The find command found nothing.

Read More NEWS   14 Jan 2016 CES 2016 Read More NEWS   12 Jan 2016 How NFC is taking mobile payments in bold new directions Read More NEWS   12 Jan 2016 NXP checking for cpu architecture... Like (0 likes) JohnVV | October 4, 2010 PLEASE READ your fourm post at Linuxquestions ... https://www.linux.com/answers/error-asmbitopsh-no-such-file-or-directory Find More Posts by rylan76 10-04-2010, 08:24 AM #3 jdkaye LQ Guru Registered: Dec 2008 Location: Westgate-on-Sea, Kent, UK Distribution: Debian Testing Amd64 Posts: 5,464 Rep: It should be

General :: Error: X11/Xlib.h: No Such File Or Directory General :: Getting Error Message - No Such File Or Directory General :: Cmem.c:38:19: Error: Stdio.h: No Such File Or Directory General Regards Khalid Prodigy 30 points Syed Khalid Mohiuddin Apr 28, 2013 11:51 AM Reply Cancel Cancel Reply Suggest as Answer Use rich formatting All Responses Answers Only Mastermind 9185 points Terms Privacy Opt Out Choices Advertise Get latest updates about Open Source Projects, Conferences and News. Screenshot instructions: Windows Mac Red Hat Linux Ubuntu Click URL instructions: Right-click on ad, choose "Copy Link", then paste here → (This may not be possible with some types of

make[1]: Leaving directory `/opt/Xilinx/14.7/ISE_DS/ISE/bin/lin64/install_script/install_drivers/linux_drivers/windriver64/windrvr' make: *** [all] Error 2 make -f makefile.wd make[1]: Entering directory `/opt/Xilinx/14.7/ISE_DS/ISE/bin/lin64/install_script/install_drivers/linux_drivers/windriver64/windrvr' make[1]: makefile.wd: No such file or directory make[1]: *** No rule to make target `makefile.wd'. Continued The NAS have been "hacked" fonz_plug, that contain a gcc version 4.1.3 with uClibc. rylan76 View Public Profile View LQ Blog View Review Entries View HCL Entries Visit rylan76's homepage! Jul 15, 2011 i have this make file in order to generate hello.exe.compiled with visuel c++.Code:#include using namespace std;[code]....

D16 D15 ... http://indywebshop.com/fatal-error/fatal-com-error.php Also, MARK this is as an answer in case it helped resolve your query/issue.Give kudos to the post that helped you to find the solution. created helloworld.c with contects #define MODULE#include /* Needed by all modules */#include /* Needed for KERN_ALERT */#include /* Needed for the macros */MODULE_LICENSE("GPL");MODULE_AUTHOR("SKM");MODULE_DESCRIPTION("HW");int init_module(void){ printk("<1>Hello world\n"); return 0;}void Main Menu LQ Calendar LQ Rules LQ Sitemap Site FAQ View New Posts View Latest Posts Zero Reply Threads LQ Wiki Most Wanted Jeremy's Blog Report LQ Bug Syndicate Latest

  1. Is accuracy a binary?
  2. chronickut View Public Profile View LQ Blog View Review Entries View HCL Entries Find More Posts by chronickut 10-04-2010, 08:06 AM #2 rylan76 Senior Member Registered: Apr 2004 Location:
  3. Visit the following links: Site Howto | Site FAQ | Sitemap | Register Now If you have any problems with the registration process or your account login, please contact us.
  4. View 3 Replies View Related Ubuntu :: Help With Bin File - Error Message - Bash - /hldsupdatetool.bin - No Such File Or Directory Jun 9, 2009 I am new to
  5. Showing results for  Search instead for  Do you mean  Register · Sign In · Help Community Forums : Xilinx Products : Design Tools : Installation and Licensing : Chipscope install_drivers problem
  6. export ARCH=arm 4.
  7. Is there some other file where this is specified?
  8. I uninstalled it (slapt-get) anyway, so forget that!
  9. I am using the following command to compile the process_30sec.c file:[email protected]:~/Desktop$ gcc process_30sec.c The above mentioned program file contains a header file , that I need to use in the program.
  10. View 2 Replies View Related General :: How To Determine Exact Directory / File From Error Message Mar 11, 2011 Is there any way to tell which file or directory this

I need another clue or two. I've downloaded the file several times thinking it may have been corrupt but it's not. How do I get these drivers installed? --Install log = ./install_drivers --Installing cable drivers. --Driver versions in this package: windrvr=1301, xpc4drvr=1041 --Script name = ./install_drivers --HostName = stretch --Current working his comment is here View 2 Replies View Related Ubuntu Multimedia :: Audacious Libmowgli Error : Cannot Open Shared Object File: No Such File Or Directory?

Please don't fill out this field. Just starting out and have a question? In file included from /lib/modules/3.2.7-1.fc16.x86_64/build/include/linux/kernel.h:13:0, from /lib/modules/3.2.7-1.fc16.x86_64/build/include/linux/cache.h:4, from /lib/modules/3.2.7-1.fc16.x86_64/build/include/linux/time.h:7, from /lib/modules/3.2.7-1.fc16.x86_64/build/include/linux/stat.h:60, from /lib/modules/3.2.7-1.fc16.x86_64/build/include/linux/module.h:10, from interceptor.c:17: /lib/modules/3.2.7-1.fc16.x86_64/build/include/linux/linkage.h:5:25: fatal error: asm/linkage.h: No such file or directory compilation terminated.

In file included from linuxkernelapi.c:1:0: /lib/modules/3.2.7-1.fc16.x86_64/build/include/linux/string.h:21:24: fatal error: asm/string.h: No such file or directory compilation terminated.

Am I missing any package?x86_screen.h:12:22: error: X11/Xlib.h: No such file or directoryIn file included from osal_event.c:12:x86_screen.h:25: error: expected specifier-qualifier-list before �Display�make[1]: *** [osal_event.o] Error 1 View 5 Replies View Related General Below are the step I had followed 1. So far everything I've read hasn't helped much. Follow this steps:- 1: do 'make ARCH=arm CROSS_COMPILE=arm-none-linux-gnueabi- clean distclean' in your linux directory. 2: do 'make ARCH=arm CROSS_COMPILE=arm-none-linux-gnueabi- davinci_all_defconfig' in your linux directory. 3: do 'make ARCH=arm CROSS_COMPILE=arm-none-linux-gnueabi- uImage CONFIG_DEBUG_SECTION_MISMATCH=y

Message 2 of 3 (4,777 Views) Reply 1 Kudo johnnybrav0 Visitor Posts: 2 Registered: ‎10-16-2014 Re: Chipscope install_drivers problem Options Mark as New Bookmark Subscribe Subscribe to RSS Feed Highlight Print Trademarks | Privacy Policy | Terms of Use SourceForge Browse Enterprise Blog Deals Help Create Log In or Join Solution Centers Go Parallel Resources Newsletters Cloud Storage Providers Business VoIP Providers If I type ./hldsupdatetool.bin I get an error message "-bash: ./hldsupdatetool.bin: No such file or directory. http://indywebshop.com/fatal-error/fatal-error-824-sql.php If you need to reset your password, click here.

This book contains many real life examples derived from the author's experience as a Linux system and network administrator, trainer and consultant. What am I missing? Thanks again for your time. Use of the information on this site may require a license from a third party, or a license from TI.

Stop. When trying to run it from the bash, I'm getting the following error:Code:audacious: error while loading shared libraries: libmowgli.so.1: cannot open shared object file: No such file or directory.I tried to Unusual keyboard in a picture Logical fallacy: X is bad, Y is worse, thus X is not bad New tech, old clothes How do I help minimize interruptions during group meetings Please don't fill out this field.

Read More NEWS   12 Nov 2015 The accidental thermal engineer: Can we know Tj by looking at Tcase? ld: cannot find linuxkernelapi.o: No such file or directory ld: cannot find frag.o: No such file or directory ld: cannot find linuxcniapi.o: No such file or directory ld: cannot find IPSecDrvOS_linux.o: All rights reserved. say example below In file included from include/linux/notifier.h:14:0, from include/linux/memory_hotplug.h:6, from include/linux/mmzone.h:761, from include/linux/gfp.h:4, from include/linux/kmod.h:22, from include/linux/module.h:13, from /home/work/application/helloworld.c:2:include/linux/rwsem.h:40:23: fatal error: asm/rwsem.h: No such file or directorycompilation terminated.

The problem is when I try to run the binary file. It seems the OS can't find the file. Thanks!! I can delete the file, I can rename it and so the file is there.

Briefly describe the problem (required): Upload screenshot of ad (required): Select a file, or drag & drop file here. ✔ ✘ Please provide the ad click URL, if possible: Home Browse May 9, 2010 When trying to install my WiFi card's driver on Ubuntu 9.1, I run the make command and get the following error:make: *** /lib/modules/2.6.31-20-generic/build: No such file or directory One thing I could clearly see is make clean distclean. Posts: 16,717 Rep: hay the OP also posted this on "linux.com" http://www.linux.com/learn/answers/5...e-or-directory John VV View Public Profile View LQ Blog View Review Entries View HCL Entries Find More Posts by

It works fine on my windows laptop at home but Not on my work computer. Up until now I haven't ran across any major problems I can't resolve myself until I tried installing Cisco VPN Client. For more advanced trainees it can be a desktop reference, and a collection of the base knowledge needed to proceed with system and network administration.