Home > Fatal Error > Fatal Error 694 Occurred

Fatal Error 694 Occurred

ig0774 commented Apr 20, 2016 @PieterO: If you can find out what the error is from the console, I'm trying to address these issues quickly. Forgot your username? Your cache administrator is webmaster. share|improve this answer answered May 17 '13 at 11:05 Michael Gardner 4,34441427 add a comment| Your Answer draft saved draft discarded Sign up or log in Sign up using Google navigate here

Start your free trial now!Our Training Video Training Books On-Site Training Our Books MySQL Explained Drupal 7 Explained Joomla 3 Explained Joomla Explained About OSTraining About Us Our Team Our Blog I try to disable the patches, but nothing changed. Am I missing something (quite possible, Python really isn't my thing)? The behaviour is always the same. click

Are there any rules or guidelines about designing a flag? Revert patch on `distutils._msvccompiler.MSVCCompiler.library_dir_option` See comments on #694.">revert `library_dir_option` patch. … Revert patch on `distutils._msvccompiler.MSVCCompiler.library_dir_option` See comments on #694. a5791ac JGoutin referenced this issue Aug 5, 2016 Merged revert Please become a member of OSTraining to reply to this post.

Additional information Refer to the write-up for “Error 605” for a discussion of potential causes of hardware errors. close× You can build great websites. Generated Sat, 15 Oct 2016 15:16:51 GMT by s_ac15 (squid/3.5.20) Cookies helfen uns bei der Bereitstellung unserer Dienste. Please become a member of OSTraining to reply to this post.

At least it can reduce it, which maybe can depend on the order of imports. So distutils._msvccompiler is used unpatched. Please try the request again. The following user(s) said Thank You: ColSweeto Fatal Error on site install 8 months 1 week ago #122512 steffmomo OFFLINE Posts: 17 Thank you received: 2 I had the same problem.

Already have an account? Python Packaging Authority member jaraco commented Jul 30, 2016 Also, there were some regressions identified, so do try the latest version also to see if perhaps that helps. Looks like a bug that they'll need to get fixed. Please become a member of OSTraining to reply to this post.

  • This is for testing purpose.The problem is that the installation finished sucessfully, but when we try to use the system we get a lot of commit errors and dumbs.Checking the Sybase
  • Basically everything in the MSVC support changed :/ and nothing else.
  • Sign in to comment Contact GitHub API Training Shop Blog About © 2016 GitHub, Inc.
  • vallsv commented Jul 28, 2016 Hi.
  • Is your build working with this PR #715 ?

Reload to refresh your session. Check whether dbcc checkalloc or dbcc checkdb is running concurrently with other activities on the server. Maybe a conflict with Numpy distutils fixes ? This was working very well.

Still getting the same error. check over here I have to ask my co-worker (who is not here), and i will come back to that issue if we really need to mix tools. But I don't see other change in changelog. Loaded 0 bibitems Found 0 total bib entries Traceback (most recent call last): File ".\sublime_plugin.py", line 362, in run_ File ".\latex_cite_completions.py", line 743, in run File ".\latex_cite_completions.py", line 656, in get_cite_completions

Both numbers and leading _ should be supported. But the line in my bib file which causes the error is not specified... (hard to debugg): Traceback (most recent call last): File "./sublime_plugin.py", line 362, in run_ File "./latex_cite_completions.py", line Go into your settings.php file and leave the database password blank. http://indywebshop.com/fatal-error/fatal-error-has-occurred.php Nov. 2014  Zitat exportierenBiBTeXEndNoteRefManÜber Google Books - Datenschutzerklärung - AllgemeineNutzungsbedingungen - Hinweise für Verlage - Problem melden - Hilfe - Sitemap - Google-Startseite ERROR The requested URL could not be retrieved The

Sybase Inc. win-amd64-3.5\Release\pyFAI\ext\splitPixelFullCSR.obj /openmp Found executable C:\Program Files (x86)\Microsoft Visual Studio 14.0\VC\BIN\x86_ amd64\cl.exe C:\Program Files (x86)\Microsoft Visual Studio 14.0\VC\BIN\x86_amd64\link.exe /n ologo /INCREMENTAL:NO /LTCG /DLL /MANIFEST:EMBED,ID=2 /MANIFESTUAC:NO /LIBPATH:c :\python35-amd64\Libs /LIBPATH:C:\Users\valls\pyFAI_venv\libs /LIBPATH:C:\Users\ valls\pyFAI_venv\PCbuild\amd64 /LIBPATH:"C:\Program Files BTW it would be nice to avoid except Exception: pass without any warning or log.

thanks sybase share|improve this question edited May 17 '13 at 9:22 asked May 17 '13 at 9:06 Moudiz 2,69232256 First, it's a Sybase product, so you should probably check

Hope it fix the problem. This means that the cache was not able to resolve the hostname presented in the URL. It now works thank you very much. Now, when I write \cite{ in the other tex files, nothing is happening.

You signed out in another tab or window. Best regards qnp changed the title from \cite popup no longer working in new release of LaTeXTools (3.7.3) to \cite dropdown no longer working in new release of LaTeXTools (3.7.3) Apr Sign in to comment Contact GitHub API Training Shop Blog About © 2016 GitHub, Inc. weblink Appease Your Google Overlords: Draw the "G" Logo How is the Heartbleed exploit even possible?

You may lose PackageControl auto-updating if you do so, however. JGoutin commented Aug 8, 2016 Numpy seem to already use Setuptools. To have bibliography parsing available in the other tex files, I used \iffalse \bibliography{../biblio.bib} \fi. vallsv referenced this issue in silx-kit/pyFAI Jul 27, 2016 Closed Building problem on Appveyor/Python 3.5/setuptools 24.*/25.* #367 JGoutin commented Jul 27, 2016 • edited The MSCV patch return environment as a

I/O did not occur, buffer contents are unchanged. JGoutin added a commit that referenced this issue Aug 5, 2016 JGoutin