Home > Failed To > Failed To Create Assembly Error Adding File

Failed To Create Assembly Error Adding File

Contents

java maven maven-assembly-plugin share|improve this question asked Jul 18 '11 at 18:00 troutwine 2,28511441 1 How are you running your maven build? Reload to refresh your session. Is caused because the project artifact (com.carepilot.khatami:khatami:jar:1.0-SNAPSHOT) has not been packaged yet, but is part of the assembly's . The simple answer is: Maven can not calculate the reactor build order in the right manner. http://indywebshop.com/failed-to/failed-to-create-assembly-error-adding-file-to-archive.php

The solution of the problem can be simply achieved by defining the appropriate dependencies to the modules you would like to pack into your distribution package like this: Enhanced POM file In our example, goals "mvn clean package" are changed to "mvn clean package clean clover:setup verify clover:aggregate clover:clover". This looks like some maven configuration problem. Ok. click for more info

Failed To Create Assembly Error Adding File To Archive

When automatic Clover integration is selected, all Maven tasks defined in a Job are enhanced by new set of goals/phases (like "clean clover:setup verify clover:aggregate clover:clover") which are being appended at or [ERROR] Failed to execute goal org.apache.maven.plugins:maven-assembly-plugin:2.4:single (make-assembly) on project xyz: Failed to create assembly: Error creating assembly archive withdep: Problem creating jar: jar:file:/opt/bamboo-agent-home/xml-data/build-dir/PROJ-PLAN-JOB/target/xyz-1.0.0-SNAPSHOT.jar!/instrumentation.ser -> [Help 1] org.apache.maven.lifecycle.LifecycleExecutionException: Failed to execute parent POM file 1 2 3 4 5 6 7 8 9 10 11 12 13 14 15 16 17 18 19 20 21 22 23 24 25 26 27 28 Caused by: java.lang.NullPointerException at org.codehaus.plexus.components.io.resources.PlexusIoURLResource.getContents(PlexusIoURLResource.java:38) ...

How to mount a disk image from the command line? I have had this kind of issue and I tracked it to my m2eclipse plugin. (which s**ks .. In the case of m2eclipse workspace resolution, the project artifacts effectively point to the result of the 'process-classes' phase in most cases, IIRC, which is why the project artifact is a Mojoexecutionexception In Maven asked 5 years ago viewed 14558 times active 4 years ago Related 0how to assemble external artifacts into one global directory with the maven-assembly-plugin (or otherwise)2How to get maven assembly plugin

I don't make use of any IDE. –troutwine Jul 18 '11 at 18:46 add a comment| 2 Answers 2 active oldest votes up vote 12 down vote accepted The relevant part Failed To Create Assembly You Must Set At Least One File It massively impairs the work with m2eclipse for me. The problem is that doing in this way I obtain the following error message into the Eclipse console: ....................................................... ....................................................... ....................................................... https://dev.eclipse.org/mhonarc/lists/m2e-users/msg04918.html at org.apache.maven.plugin.DefaultBuildPluginManager.executeMojo(DefaultBuildPluginManager.java:110) ...

If you need the project's class file included in the assembly, you can use a to include directory target/classes. Maven Package With Dependencies share|improve this answer answered Jul 20 '15 at 13:50 SomeStudent 401111 add a comment| Your Answer draft saved draft discarded Sign up or log in Sign up using Google Sign My CEO wants permanent access to every employee's emails. If Dumbledore is the most powerful wizard (allegedly), why would he work at a glorified boarding school?

Failed To Create Assembly You Must Set At Least One File

Does m2e use correct maven installation? [1] http://docs.codehaus.org/display/M2ECLIPSE/Project+FAQ#ProjectFAQ-HowtoretrieveanactualcommandlineusedtostartJVMandMaven-- Regards, Igor Scara Maccai wrote: > > Eugene Kuleshov wrote: >> Sara, >> >> This question is answered in the project FAQ at haebin referenced this issue Oct 14, 2013 Closed master branch (0.4.0) build fails. #421 mbroecheler closed this Nov 6, 2013 Sign up for free to join this conversation on GitHub. Failed To Create Assembly Error Adding File To Archive Physically locating the server In the United States is racial, ethnic, or national preference an acceptable hiring practice for departments or companies in some situations? (KevinC's) Triangular DeciDigits Sequence Are independent Failed To Create Assembly Error Adding File Isn't A File From that project, I am inheriting a jar project that has an assembly descriptor attached to the package phase, via the assembly plugin.

Cause A problem is related with BAM-13208 - Improve Automatic Clover integration for multi-module maven builds Resolved . http://indywebshop.com/failed-to/failed-to-create-dump-file-error-183-coh.php What is a type system? Hide Permalink Daniel Lipp added a comment - 09/Mar/12 8:24 AM Another example: standard-templating-kit-bundle#4720 Show Daniel Lipp added a comment - 09/Mar/12 8:24 AM Another example: standard-templating-kit-bundle#4720 Daniel Lipp made changes Personal Open source Business Explore Sign up Sign in Pricing Blog Support Search GitHub This repository Watch 394 Star 4,041 Fork 823 thinkaurelius/titan Code Issues 129 Pull requests 37 Projects Error Reading Assemblies: No Assembly Descriptors Found

Not the answer you're looking for? I would add the assembly:single goal to the package phase, that way it will build automatically. maven-assembly-plugin package single src/main/assembly/src.xml ${project.groupId}.Main Terms Privacy Security Status Help You can't perform that action at this time. http://indywebshop.com/failed-to/failed-to-create-assembly-error-filtering-file.php You may have not properly set up your bash profile and stipulate where the maven directory is located.

Results : Tests run: 2, Failures: 0, Errors: 0, Skipped: 0 [INFO] [INFO] --- maven-jar-plugin:2.4:jar (default-jar) @ maventutorial1 --- [INFO] Building jar: /home/andrea/git/maven-java-console-application/mvntutorial1/target/maventutorial1-0.0.1-SNAPSHOT.jar [INFO] [INFO] --- maven-assembly-plugin:2.5.5:single (default-cli) @ maventutorial1 --- Maven Assembly Plugin Example Try JIRA - bug tracking software for your team. Change the plugin entry to this : maven-assembly-plugin com.test.MainClassName jar-with-dependencies make-assembly package single

We recommend upgrading to the latest Safari, Google Chrome, or Firefox.

What am I missing? Players stopping other player actions How to convert a set of sequential integers into a set of unique random numbers? It´s usually a good practice to fix such code smells. Maven-shade-plugin You signed in with another tab or window.

more stack exchange communities company blog Stack Exchange Inbox Reputation and Badges sign up log in tour help Tour Start here for a quick overview of the site Help Center Detailed Is there a place in academia for someone who compulsively solves every problem on their own? Show John Casey added a comment - 23/Sep/10 09:52 the assembly plugin expects dependencies to be single files, not directories. navigate here In the case of a multimodule build with interdependencies, this means the assembly plugin needs to run at or after the 'package' phase, IF that assembly contains dependencySet's that reference other

Hide Permalink John Casey added a comment - 23/Sep/10 09:52 the assembly plugin expects dependencies to be single files, not directories. Is there a role with more responsibility? A better way to do this might be to use the maven-shade-plugin instead of doing this manually. at org.codehaus.plexus.archiver.AbstractArchiver.addFile(AbstractArchiver.java:414) at org.codehaus.plexus.archiver.AbstractArchiver.addFile(AbstractArchiver.java:340) at org.apache.maven.plugin.assembly.archive.archiver.AssemblyProxyArchiver.addFile(AssemblyProxyArchiver.java:563) at org.apache.maven.plugin.assembly.archive.task.AddArtifactTask.execute(AddArtifactTask.java:211) ... 27 more[ERROR]Â[ERROR]Â[ERROR] For more information about the errors and possible solutions, please read the following articles:[ERROR] [Help 1] http://cwiki.apache.org/confluence/display/MAVEN/MojoExecutionExceptionThis seems to be

In case when your original goals are: mvn clean they should be changed to: mvn clean clover:setup clover:aggregate clover:clover Notes The NullPointerException thrown Free forum by Nabble Edit this page SoftwareEntwicklung Beratung Schulung A coders, hackers heaven.....Hm...I do not think so... NullPointerException -> [Help 1] org.apache.maven.lifecycle.LifecycleExecutionException: Failed to execute goal org.apache.maven.plugins:maven-assembly-plugin:2.3:single (make-assembly) on project xyz: Execution make-assembly of goal org.apache.maven.plugins:maven-assembly-plugin:2.3:single failed. Note that m2e always uses embedded maven during eclipse build.

See http://jira.codehaus.org/browse/MNGECLIPSE-1201 Show Christoph Kutzinski added a comment - 03/Mar/09 02:15 The maintainers of m2eclipse say that this is related to the workspace resolution feature and that I could be easier How? You signed out in another tab or window. As a consequence, Maven Assembly Plugin fails accessing files like: **/instrumentation.ser **/groverconfig*/* **/classes/**/*$__CLR*.class Solution In order to avoid such problems, Maven shall not run the same build phase twice.

Skip to content Ignore Learn more Please note that GitHub no longer supports old versions of Firefox. So if I understood correctly, there is a Âproblem while using a multimodule project with interdependencies in m2e. I suspect it's related to the increased number (now 4) of executors. See questions about this article Powered by Confluence and Scroll Viewport Atlassian Support Ask the community Provide product feedback Contact technical support Atlassian Privacy Policy Terms of use Security Copyright ©